{"text_format":"1","workbook":"xlsx","n_sheets":17,"sheets":["COVER","Definitions","Comments","Navigation","Product Classes","Efficiency Levels","Equipment Specifications","Constants and Menus","Product Class Dist","Efficiency Dist","Shipments and Stock ","6P UEC Development","UEC Development","UEC","RESULTS","SUMMARY RESULTS","Charts"],"not_rendered":{"charts":13,"images":0,"macros":1,"external_links":1,"defined_names":3,"comments":0,"pivot_tables":0},"unopened":[],"bounds":{"document_bytes":16777216,"sheet_cells":100000,"rows_first":2000,"rows_last":500,"rows_between":2000,"halvings":0,"cell_chars":16384,"cell_head_chars":4096},"cells_cut":0,"cells_raw":0,"read":"whole","date_system":"1900"}

{"sheet":"COVER","index":0,"n_rows":28,"n_cols":4,"rows_kept":28,"cut":false,"hidden":false,"merged":[[22,2,22,3],[8,2,8,3],[9,2,9,3],[10,2,10,3],[13,2,13,3],[16,2,16,3],[18,2,18,3]]}
[]
[null,null,"Cover"]
[]
[null,null,"NAVIGATION"]
[]
[null,null,"COMMENTS"]
[]
[]
[null,null,"Bonneville Power Administration"]
[null,null,"6P Energy Conservation Standards Savings Model"]
{"$rows_left_out":19}
{"sheet":"Definitions","index":1,"n_rows":32,"n_cols":4,"rows_kept":32,"cut":false,"hidden":false,"merged":[]}
[]
[null,null,"Definitions"]
[]
[null,null,"NAVIGATION"]
[]
[null,null,"COMMENTS"]
[]
[]
[null,null,"Average Megawatt (aMW)","The average number of megawatts over a specified time period"]
[null,null,"Adjustment to 6P Baseline ","Adjustment to reconcile the 6P projected energy consumption and the modeled consumption calculated using best available data."]
{"$rows_left_out":23}
{"sheet":"Comments","index":2,"n_rows":8,"n_cols":4,"rows_kept":8,"cut":false,"hidden":false,"merged":[[13,3,13,7],[14,3,14,7],[15,3,15,7],[16,3,16,7],[7,3,7,7],[8,3,8,7],[9,3,9,7],[10,3,10,7],[11,3,11,7],[12,3,12,7]]}
[]
[null,null,"Comments"]
[]
[null,null,"NAVIGATION"]
[]
[]
[null,null,"Tab","Comment"]
[null,null,"Example","Please use this space to document your comments as you review the model.  We look forward to receiving your feedback.  Thank you."]

{"sheet":"Navigation","index":3,"n_rows":23,"n_cols":11,"rows_kept":23,"cut":false,"hidden":false,"merged":[[16,10,17,10],[16,2,20,2],[10,6,12,6],[16,6,20,6],[16,8,17,8],[19,8,22,8]]}
[]
[null,null,"NAVIGATION"]
[]
[null,null,"COMMENTS"]
[]
[]
[null,null,"INFORMATION TABS",null,"INPUT TABS",null,"UEC CALCULATIONS",null,"RESULTS",null,"CHARTS"]
[]
[null,null,"COVER",null,"PRODUCT CLASSES"]
[]
{"$rows_left_out":14}
{"sheet":"Product Classes","index":4,"n_rows":21,"n_cols":9,"rows_kept":21,"cut":false,"hidden":false,"merged":[]}
[]
[null,null,"Selection of Product Classes for Model"]
[]
[null,null,"NAVIGATION"]
[]
[null,null,"COMMENTS"]
[]
[]
[null,null,"All Product Classes","2011 DOE DFR PCs 1","DOE Representative PCs 1","6th Plan PCs 2",null,"Model PCs","Rationale"]
[null,null,"Class A- Small (ASIN)","DOE- PC1","PC1","6P- PC1",null,"PC1","Aligns with 6P assumptions"]
{"$rows_left_out":12}
{"sheet":"Efficiency Levels","index":5,"n_rows":103,"n_cols":6,"rows_kept":103,"cut":false,"hidden":false,"merged":[[1,2,1,3],[3,2,3,3],[5,2,5,3]]}
[]
[null,null,"Efficiency Levels and Standards for Each Product Class"]
[]
[null,null,"NAVIGATION"]
[]
[null,null,"COMMENTS"]
[]
[]
[null,null,"PC1",{"$f":"OFFSET('Product Classes'!$C$9,MATCH(C9,'Product Classes'!$H$10:$H$15,0),0)","v":"Class A- Small (ASIN)"}]
[]
{"$rows_left_out":94}
{"sheet":"Equipment Specifications","index":6,"n_rows":39,"n_cols":6,"rows_kept":39,"cut":false,"hidden":false,"merged":[[36,3,36,5],[26,3,26,5],[27,3,27,5],[28,3,28,5]]}
[]
[null,null,"Equipment Specifications"]
[]
[null,null,"NAVIGATION"]
[]
[null,null,"COMMENTS"]
[]
[]
[null,null,"Equipment Specifications"]
[]
{"$rows_left_out":30}
{"sheet":"Constants and Menus","index":7,"n_rows":38,"n_cols":4,"rows_kept":38,"cut":false,"hidden":false,"merged":[]}
[]
[null,null,"Constants and Menus"]
[]
[null,null,"NAVIGATION"]
[]
[null,null,"COMMENTS"]
[]
[]
[null,null,"Constant"]
[null,null,"Hours/Day",24]
{"$rows_left_out":29}
{"sheet":"Product Class Dist","index":8,"n_rows":25,"n_cols":48,"rows_kept":25,"cut":false,"hidden":false,"merged":[]}
[]
[null,null,"Product Class Distributions"]
[]
[null,null,"NAVIGATION"]
[]
[null,null,"COMMENTS"]
[]
[]
[null,null,"PRE-Case",1990,{"$f":"D9+1","v":1991},{"$f":"E9+1","v":1992},1993,1994,1995,1996,1997,1998,1999,2000,2001,2002,2003,2004,2005,2006,2007,2008,{"$f":"V9+1","v":2009},2010,2011,2012,2013,2014,2015,2016,2017,2018,2019,2020,2021,2022,2023,2024,2025,2026,2027,2028,2029,2030,2031,2032,2033,2034]
[null,null,{"$f":"'Product Classes'!H10&\" - \"&OFFSET('Product Classes'!$C$9,MATCH('Product Classes'!H10,MODEL_PCS,0),0)","v":"PC1 - Class A- Small (ASIN)"},0,0,0,0,0,0,0,0,0,0,0,0,0,0,0,0,0,0,0,0,0,0,0,0,0,0,0,0,0,0,0,0,0,0,0,0,0,0,0,0,0,0,0,0,0]
{"$rows_left_out":16}
{"sheet":"Efficiency Dist","index":9,"n_rows":185,"n_cols":52,"rows_kept":185,"cut":false,"hidden":false,"merged":[[1,2,1,6],[3,2,3,6],[5,2,5,6]]}
[]
[null,null,"Efficiency Distributions by Product Class - Single Family"]
[]
[null,null,{"$f":"Navigation!$C$15","v":"NAVIGATION"}]
[]
[null,null,"COMMENTS"]
[]
[]
[null,null,null,{"$f":"'Product Classes'!H10&\" - \"&OFFSET('Product Classes'!$C$9,MATCH('Product Classes'!H10,MODEL_PCS,0),0)","v":"PC1 - Class A- Small (ASIN)"}]
[]
{"$rows_left_out":176}
{"sheet":"Shipments and Stock ","index":10,"n_rows":18,"n_cols":52,"rows_kept":18,"cut":false,"hidden":false,"merged":[]}
[]
[null,null,"Shipments and Stock"]
[]
[null,null,"NAVIGATION"]
[]
[null,null,"COMMENTS"]
[]
[null,null,"Building Type "]
[null,null,{"$f":"RESULTS!$C$9","v":"TOTAL"}]
[]
{"$rows_left_out":9}
{"sheet":"6P UEC Development","index":11,"n_rows":12,"n_cols":5,"rows_kept":12,"cut":false,"hidden":false,"merged":[]}
[]
[null,null,"Council UEC Development"]
[]
[null,null,"NAVIGATION"]
[]
[null,null,"COMMENTS"]
[]
[]
[null,null,"6P Average UEC",1479,"kWh/year"]
[]
{"$rows_left_out":3}
{"sheet":"UEC Development","index":12,"n_rows":98,"n_cols":5,"rows_kept":98,"cut":false,"hidden":false,"merged":[[58,3,58,4],[73,3,73,4],[88,3,88,4],[10,3,10,4],[1,2,1,3],[3,2,3,3],[26,3,26,4],[42,3,42,4],[5,2,5,3]]}
[]
[null,null,"UEC Development "]
[]
[null,null,"NAVIGATION"]
[]
[null,null,"COMMENTS"]
[]
[]
[null,null,{"$f":"'Product Classes'!H10&\" - \"&OFFSET('Product Classes'!$C$9,MATCH('Product Classes'!H10,MODEL_PCS,0),0)","v":"PC1 - Class A- Small (ASIN)"}]
[]
{"$rows_left_out":89}
{"sheet":"UEC","index":13,"n_rows":18,"n_cols":48,"rows_kept":18,"cut":false,"hidden":false,"merged":[]}
[]
[null,null,"Weighted Annual UEC"]
[]
[null,null,"NAVIGATION"]
[]
[null,null,"COMMENTS"]
[]
[]
[null,null,"Market UEC (Shipment Weighted Average)"]
[null,null,null,1990,{"$f":"D10+1","v":1991},{"$f":"E10+1","v":1992},1993,1994,1995,1996,1997,1998,1999,2000,2001,2002,2003,2004,2005,2006,2007,2008,2009,2010,2011,2012,2013,2014,2015,2016,2017,2018,2019,2020,2021,2022,2023,2024,2025,2026,2027,2028,2029,2030,2031,2032,2033,2034]
{"$rows_left_out":9}
{"sheet":"RESULTS","index":14,"n_rows":46,"n_cols":28,"rows_kept":46,"cut":false,"hidden":false,"merged":[]}
[]
[null,null,"RESULTS "]
[]
[null,null,"NAVIGATION"]
[]
[null,null,"COMMENTS"]
[]
[null,null,"Building Type "]
[null,null,"TOTAL"]
[]
{"$rows_left_out":37}
{"sheet":"SUMMARY RESULTS","index":15,"n_rows":12,"n_cols":4,"rows_kept":12,"cut":false,"hidden":false,"merged":[]}
[]
[null,null,"SUMMARY RESULTS"]
[]
[null,null,"NAVIGATION"]
[]
[null,null,"COMMENTS"]
[]
[]
[null,null,null,{"$f":"RESULTS!$C$9","v":"TOTAL"}]
[null,null,"Adjustment to 6P Baseline (aMW)","N/A"]
{"$rows_left_out":3}
{"sheet":"Charts","index":16,"n_rows":6,"n_cols":3,"rows_kept":6,"cut":false,"hidden":false,"merged":[]}
[]
[null,null,"CHARTS "]
[]
[null,null,"NAVIGATION"]
[]
[null,null,"COMMENTS"]